Reaction Details
TargetHistone deacetylase 1
LigandBDBM50080005
Substrate/Competitorn/a
Meas. Tech.ChEMBL_1471150 (CHEMBL3421040)
IC50 524±n/a nM
Citation Sodji, QHKornacki, JRMcDonald, JFMrksich, MOyelere, AK Design and structure activity relationship of tumor-homing histone deacetylase inhibitors conjugated to folic and pteroic acids. Eur J Med Chem96:340-59 (2015) 
 
Histone deacetylase 1
Name:Histone deacetylase 1
Type:Enzyme
Mol. Mass.:55090.27
Organism:Homo sapiens (Human)
Description:Q13547
Residue:482
BDBM50080005
NameBDBM50080005
Synonyms:CHEMBL3415965
TypeSmall organic molecule
Emp. Form.C23H30N8O4
Mol. Mass.482.5355
SMILESNc1nc2ncc(CNc3ccc(cc3)C(=O)NCCCCCCCCC(=O)NO)nc2c(=O)[nH]1