Reaction Details
TargetEpithelial discoidin domain-containing receptor 1
LigandBDBM50080409
Substrate/Competitorn/a
Meas. Tech.ChEMBL_1474756 (CHEMBL3424174)
IC50 97±n/a nM
Citation Li, YLu, XRen, XDing, K Small molecule discoidin domain receptor kinase inhibitors and potential medical applications. J Med Chem58:3287-301 (2015) 
 
Epithelial discoidin domain-containing receptor 1
Name:Epithelial discoidin domain-containing receptor 1
Type:Tyrosine-protein kinase
Mol. Mass.:101130.02
Organism:Homo sapiens (Human)
Description:Q08345
Residue:913
BDBM50080409
NameBDBM50080409
Synonyms:CHEMBL3422020 | US9695118, 43
TypeSmall organic molecule
Emp. Form.C23H27ClF3N3O3S
Mol. Mass.517.992
SMILESCCS(=O)(=O)c1ccc(Cl)cc1CNC(=O)c1ccc(CN2CCN(C)CC2)c(c1)C(F)(F)F