Reaction Details
TargetDiscoidin domain-containing receptor 2
LigandBDBM50430875
Substrate/Competitorn/a
Meas. Tech.ChEMBL_1474750 (CHEMBL3424168)
IC50 145±n/a nM
Citation Li, YLu, XRen, XDing, K Small molecule discoidin domain receptor kinase inhibitors and potential medical applications. J Med Chem58:3287-301 (2015) 
 
Discoidin domain-containing receptor 2
Name:Discoidin domain-containing receptor 2
Type:Protein
Mol. Mass.:96717.07
Organism:Homo sapiens (Human)
Description:Q16832
Residue:855
BDBM50430875
NameBDBM50430875
Synonyms:CHEMBL2336005 | US9062066, LCB 03-0110
TypeSmall organic molecule
Emp. Form.C24H23N3O2S
Mol. Mass.417.523
SMILESOc1cccc(Nc2ccnc3cc(sc23)-c2cccc(CN3CCOCC3)c2)c1