Reaction Details
TargetAldo-keto reductase family 1 member B1
LigandBDBM50049730
Substrate/Competitorn/a
Meas. Tech.ChEMBL_1475201 (CHEMBL3424956)
IC50 250±n/a nM
Citation Stefek, MSoltesova Prnova, MMajekova, MRechlin, CHeine, AKlebe, G Identification of novel aldose reductase inhibitors based on carboxymethylated mercaptotriazinoindole scaffold. J Med Chem58:2649-57 (2015) 
 
Aldo-keto reductase family 1 member B1
Name:Aldo-keto reductase family 1 member B1
Type:PROTEIN
Mol. Mass.:35797.87
Organism:Rattus norvegicus
Description:ChEMBL_1512484
Residue:316
BDBM50049730
NameBDBM50049730
Synonyms:2-(5-(2-methyl-3-phenylallylidene)-4-oxo-2-thioxothiazolidin-3-yl)acetic acid Epalrestat | {5-[(E)-2-Methyl-3-phenyl-prop-2-en-(Z)-ylidene]-4-oxo-2-thioxo-thiazolidin-3-yl}-acetic acid
TypeSmall organic molecule
Emp. Form.C15H13NO3S2
Mol. Mass.319.399
SMILESC\C(\C=C1/SC(=S)N(CC(O)=O)C1=O)=C/c1ccccc1