Reaction Details
TargetSphingosine 1-phosphate receptor 1
LigandBDBM50080559
Substrate/Competitorn/a
Meas. Tech.ChEMBL_1475218 (CHEMBL3424973)
EC50 0.100000±n/a nM
Citation Rosse, G Novel Pyridyloxadiazole Agonists of Sphingosin-1-phosphate. ACS Med Chem Lett6:102-3 (2015) 
 
Sphingosine 1-phosphate receptor 1
Name:Sphingosine 1-phosphate receptor 1
Type:Enzyme
Mol. Mass.:42836.02
Organism:Homo sapiens (Human)
Description:P21453
Residue:382
BDBM50080559
NameBDBM50080559
Synonyms:CHEMBL3126433 | US9617250, Example 8
TypeSmall organic molecule
Emp. Form.C26H32N4O5
Mol. Mass.480.5561
SMILESCCc1cc(cc(C)c1OC[C@@H](O)CNC(=O)CO)-c1noc(n1)-c1ccnc(c1)C1CCCC1