Reaction Details
TargetSphingosine 1-phosphate receptor 3
LigandBDBM50080574
Substrate/Competitorn/a
Meas. Tech.ChEMBL_1475219 (CHEMBL3424974)
EC50 3940±n/a nM
Citation Rosse, G Novel Pyridyloxadiazole Agonists of Sphingosin-1-phosphate. ACS Med Chem Lett6:102-3 (2015) 
 
Sphingosine 1-phosphate receptor 3
Name:Sphingosine 1-phosphate receptor 3
Type:G Protein-Coupled Receptor (GPCR)
Mol. Mass.:42278.13
Organism:Homo sapiens (Human)
Description:Q99500
Residue:378
BDBM50080574
NameBDBM50080574
Synonyms:CHEMBL3126603 | US9617250, Example 3
TypeSmall organic molecule
Emp. Form.C24H30N4O5
Mol. Mass.454.5188
SMILESCCc1cc(cc(C)c1OC[C@@H](O)CNC(=O)CO)-c1noc(n1)-c1ccnc(c1)C(C)C