Reaction Details
TargetMelanocortin receptor 5
LigandBDBM50080579
Substrate/Competitorn/a
Meas. Tech.ChEMBL_1475221 (CHEMBL3425019)
EC50 1800±n/a nM
Citation Doering, SRTodorovic, AHaskell-Luevano, C Melanocortin antagonist tetrapeptides with minimal agonist activity at the mouse melanocortin-3 receptor. ACS Med Chem Lett6:123-7 (2015) 
 
Melanocortin receptor 5
Name:Melanocortin receptor 5
Type:Enzyme
Mol. Mass.:36966.58
Organism:Mus musculus (Mouse)
Description:P41149
Residue:325
BDBM50080579
NameBDBM50080579
Synonyms:CHEMBL3422431
TypeSmall organic molecule
Emp. Form.C37H44IN9O5
Mol. Mass.821.707
SMILESCC(=O)N[C@@H](Cc1c[nH]c2ccccc12)C(=O)N[C@H](Cc1ccc(I)cc1)C(=O)N[C@@H](CCCNC(N)=N)C(=O)N[C@@H](Cc1ccccc1)C(N)=O