Reaction Details
TargetMelanocyte-stimulating hormone receptor
LigandBDBM50080582
Substrate/Competitorn/a
Meas. Tech.ChEMBL_1475220 (CHEMBL3424975)
EC50 20700±n/a nM
Citation Doering, SRTodorovic, AHaskell-Luevano, C Melanocortin antagonist tetrapeptides with minimal agonist activity at the mouse melanocortin-3 receptor. ACS Med Chem Lett6:123-7 (2015) 
 
Melanocyte-stimulating hormone receptor
Name:Melanocyte-stimulating hormone receptor
Type:PROTEIN
Mol. Mass.:35238.60
Organism:Mus musculus
Description:ChEMBL_1498846
Residue:315
BDBM50080582
NameBDBM50080582
Synonyms:CHEMBL3422428
TypeSmall organic molecule
Emp. Form.C43H48IN9O5
Mol. Mass.897.803
SMILESCC(=O)N[C@@H](Cc1c[nH]c2ccccc12)C(=O)N[C@H](Cc1ccc(I)cc1)C(=O)N[C@@H](CCCNC(N)=N)C(=O)N[C@@H](Cc1ccc(cc1)-c1ccccc1)C(N)=O