Reaction Details
TargetMelanocyte-stimulating hormone receptor
LigandBDBM50080583
Substrate/Competitorn/a
Meas. Tech.ChEMBL_1475220 (CHEMBL3424975)
EC50 2000±n/a nM
Citation Doering, SRTodorovic, AHaskell-Luevano, C Melanocortin antagonist tetrapeptides with minimal agonist activity at the mouse melanocortin-3 receptor. ACS Med Chem Lett6:123-7 (2015) 
 
Melanocyte-stimulating hormone receptor
Name:Melanocyte-stimulating hormone receptor
Type:PROTEIN
Mol. Mass.:35238.60
Organism:Mus musculus
Description:ChEMBL_1498846
Residue:315
BDBM50080583
NameBDBM50080583
Synonyms:CHEMBL3422427
TypeSmall organic molecule
Emp. Form.C39H45IN10O5
Mol. Mass.860.7431
SMILESCC(=O)N[C@@H](Cc1c[nH]c2ccccc12)C(=O)N[C@H](Cc1ccc(I)cc1)C(=O)N[C@@H](CCCNC(N)=N)C(=O)N[C@@H](Cc1c[nH]c2ccccc12)C(N)=O