Reaction Details
TargetMelanocortin receptor 3
LigandBDBM50080581
Substrate/Competitorn/a
Meas. Tech.ChEMBL_1475222 (CHEMBL3425020)
EC50>100000±n/a nM
Citation Doering, SRTodorovic, AHaskell-Luevano, C Melanocortin antagonist tetrapeptides with minimal agonist activity at the mouse melanocortin-3 receptor. ACS Med Chem Lett6:123-7 (2015) 
 
Melanocortin receptor 3
Name:Melanocortin receptor 3
Type:PROTEIN
Mol. Mass.:35808.24
Organism:Mus musculus
Description:ChEMBL_1498848
Residue:323
BDBM50080581
NameBDBM50080581
Synonyms:CHEMBL3422429
TypeSmall organic molecule
Emp. Form.C39H44IN9O5S
Mol. Mass.877.793
SMILESCC(=O)N[C@@H](Cc1c[nH]c2ccccc12)C(=O)N[C@H](Cc1ccc(I)cc1)C(=O)N[C@@H](CCCNC(N)=N)C(=O)N[C@@H](Cc1csc2ccccc12)C(N)=O