Reaction Details
TargetMelanocortin receptor 4
LigandBDBM50080581
Substrate/Competitorn/a
Meas. Tech.ChEMBL_1475227 (CHEMBL3425025)
EC50>100000±n/a nM
Citation Doering, SRTodorovic, AHaskell-Luevano, C Melanocortin antagonist tetrapeptides with minimal agonist activity at the mouse melanocortin-3 receptor. ACS Med Chem Lett6:123-7 (2015) 
 
Melanocortin receptor 4
Name:Melanocortin receptor 4
Type:PROTEIN
Mol. Mass.:36964.43
Organism:Mus musculus
Description:ChEMBL_1498850
Residue:332
BDBM50080581
NameBDBM50080581
Synonyms:CHEMBL3422429
TypeSmall organic molecule
Emp. Form.C39H44IN9O5S
Mol. Mass.877.793
SMILESCC(=O)N[C@@H](Cc1c[nH]c2ccccc12)C(=O)N[C@H](Cc1ccc(I)cc1)C(=O)N[C@@H](CCCNC(N)=N)C(=O)N[C@@H](Cc1csc2ccccc12)C(N)=O