Reaction Details
TargetAmine oxidase [flavin-containing] B
LigandBDBM50080871
Substrate/Competitorn/a
Meas. Tech.ChEMBL_1475316 (CHEMBL3425213)
IC50 42650±n/a nM
Citation Valente, SRodriguez, VMercurio, CVianello, PSaponara, BCirilli, RCiossani, GLabella, DMarrocco, BRuoppolo, GBotrugno, OADessanti, PMinucci, SMattevi, AVarasi, MMai, A Pure Diastereomers of a Tranylcypromine-Based LSD1 Inhibitor: Enzyme Selectivity and In-Cell Studies. ACS Med Chem Lett6:173-7 (2015) 
 
Amine oxidase [flavin-containing] B
Name:Amine oxidase [flavin-containing] B
Type:Protein
Mol. Mass.:58768.76
Organism:Homo sapiens (Human)
Description:P27338
Residue:520
BDBM50080871
NameBDBM50080871
Synonyms:CHEMBL3421672
TypeSmall organic molecule
Emp. Form.C26H28ClN3O3
Mol. Mass.465.972
SMILESCl.N[C@H]1C[C@@H]1c1ccc(NC(=O)[C@H](Cc2ccccc2)NC(=O)OCc2ccccc2)cc1