Reaction Details
TargetCannabinoid receptor 1
LigandBDBM50081046
Substrate/Competitorn/a
Meas. Tech.ChEMBL_1475403 (CHEMBL3425367)
Ki>3000±n/a nM
Citation El Bakali, JMuccioli, GGBody-Malapel, MDjouina, MKlupsch, FGhinet, ABarczyk, ARenault, NChavatte, PDesreumaux, PLambert, DMMillet, R Conformational Restriction Leading to a Selective CB2 Cannabinoid Receptor Agonist Orally Active Against Colitis. ACS Med Chem Lett6:198-203 (2015) 
 
Cannabinoid receptor 1
Name:Cannabinoid receptor 1
Type:G Protein-Coupled Receptor (GPCR)
Mol. Mass.:52868.96
Organism:Homo sapiens (Human)
Description:P21554
Residue:472
BDBM50081046
NameBDBM50081046
Synonyms:CHEMBL3421685
TypeSmall organic molecule
Emp. Form.C28H24F3N3O
Mol. Mass.475.5049
SMILESCCCCCn1c(-c2ccccc2)c2c(nn(-c3cccc(c3)C(F)(F)F)c2=O)c2ccccc12