Reaction Details
TargetCannabinoid receptor 2
LigandBDBM50224062
Substrate/Competitorn/a
Meas. Tech.ChEMBL_1475402 (CHEMBL3425366)
Ki 22±n/a nM
Citation El Bakali, JMuccioli, GGBody-Malapel, MDjouina, MKlupsch, FGhinet, ABarczyk, ARenault, NChavatte, PDesreumaux, PLambert, DMMillet, R Conformational Restriction Leading to a Selective CB2 Cannabinoid Receptor Agonist Orally Active Against Colitis. ACS Med Chem Lett6:198-203 (2015) 
 
Cannabinoid receptor 2
Name:Cannabinoid receptor 2
Type:G Protein-Coupled Receptor (GPCR)
Mol. Mass.:39690.94
Organism:Homo sapiens (Human)
Description:P34972
Residue:360
BDBM50224062
NameBDBM50224062
Synonyms:CHEMBL235487 | N3-((1-adamantyl)methyl)-4-oxo-1-pentyl-1,4-dihydroquinoline-3-carboxamide
TypeSmall organic molecule
Emp. Form.C26H34N2O2
Mol. Mass.406.5604
SMILESCCCCCn1cc(C(=O)NCC23CC4CC(CC(C4)C2)C3)c(=O)c2ccccc12