Reaction Details
TargetCannabinoid receptor 2
LigandBDBM50081039
Substrate/Competitorn/a
Meas. Tech.ChEMBL_1475402 (CHEMBL3425366)
Ki>3000±n/a nM
Citation El Bakali, JMuccioli, GGBody-Malapel, MDjouina, MKlupsch, FGhinet, ABarczyk, ARenault, NChavatte, PDesreumaux, PLambert, DMMillet, R Conformational Restriction Leading to a Selective CB2 Cannabinoid Receptor Agonist Orally Active Against Colitis. ACS Med Chem Lett6:198-203 (2015) 
 
Cannabinoid receptor 2
Name:Cannabinoid receptor 2
Type:G Protein-Coupled Receptor (GPCR)
Mol. Mass.:39690.94
Organism:Homo sapiens (Human)
Description:P34972
Residue:360
BDBM50081039
NameBDBM50081039
Synonyms:CHEMBL3421690
TypeSmall organic molecule
Emp. Form.C28H27N3O
Mol. Mass.421.5335
SMILESCCCCCn1c(-c2ccccc2)c2c(nn(Cc3ccccc3)c2=O)c2ccccc12