Reaction Details
TargetCannabinoid receptor 2
LigandBDBM50081045
Substrate/Competitorn/a
Meas. Tech.ChEMBL_1475402 (CHEMBL3425366)
Ki 1365±n/a nM
Citation El Bakali, JMuccioli, GGBody-Malapel, MDjouina, MKlupsch, FGhinet, ABarczyk, ARenault, NChavatte, PDesreumaux, PLambert, DMMillet, R Conformational Restriction Leading to a Selective CB2 Cannabinoid Receptor Agonist Orally Active Against Colitis. ACS Med Chem Lett6:198-203 (2015) 
 
Cannabinoid receptor 2
Name:Cannabinoid receptor 2
Type:G Protein-Coupled Receptor (GPCR)
Mol. Mass.:39690.94
Organism:Homo sapiens (Human)
Description:P34972
Residue:360
BDBM50081045
NameBDBM50081045
Synonyms:CHEMBL3421686
TypeSmall organic molecule
Emp. Form.C21H21N3O
Mol. Mass.331.4109
SMILESCCCCCn1cc2c(nn(-c3ccccc3)c2=O)c2ccccc12