Reaction Details
TargetGlucocorticoid receptor
LigandBDBM50081095
Substrate/Competitorn/a
Meas. Tech.ChEMBL_1475546 (CHEMBL3424572)
IC50 6.0±n/a nM
Citation Chantigny, YAMurray, JCKleinman, EFRobinson, RPPlotkin, MAReese, MRBuckbinder, LMcNiff, PAMillham, MLSchaefer, JFAbramov, YABordner, J 2-Aryl-3-methyloctahydrophenanthrene-2,3,7-triols as potent dissociated glucocorticoid receptor agonists. J Med Chem58:2658-77 (2015) 
 
Glucocorticoid receptor
Name:Glucocorticoid receptor
Type:Enzyme
Mol. Mass.:85656.87
Organism:Homo sapiens (Human)
Description:P04150
Residue:777
BDBM50081095
NameBDBM50081095
Synonyms:CHEMBL3421885
TypeSmall organic molecule
Emp. Form.C20H28O3
Mol. Mass.316.4345
SMILES[H][C@]12CCc3cc(O)ccc3[C@]1(CC)C[C@@](C)(O)[C@@](O)(C2)\C=C\C