Reaction Details
TargetGlucocorticoid receptor
LigandBDBM50081072
Substrate/Competitorn/a
Meas. Tech.ChEMBL_1475546 (CHEMBL3424572)
IC50 0.600000±n/a nM
Citation Chantigny, YAMurray, JCKleinman, EFRobinson, RPPlotkin, MAReese, MRBuckbinder, LMcNiff, PAMillham, MLSchaefer, JFAbramov, YABordner, J 2-Aryl-3-methyloctahydrophenanthrene-2,3,7-triols as potent dissociated glucocorticoid receptor agonists. J Med Chem58:2658-77 (2015) 
 
Glucocorticoid receptor
Name:Glucocorticoid receptor
Type:Enzyme
Mol. Mass.:85656.87
Organism:Homo sapiens (Human)
Description:P04150
Residue:777
BDBM50081072
NameBDBM50081072
Synonyms:CHEMBL3421890
TypeSmall organic molecule
Emp. Form.C24H28O3
Mol. Mass.364.4773
SMILES[H][C@@]12C[C@@](O)(c3ccccc3)[C@](C)(O)C[C@@]1(CC)c1ccc(O)cc1C(C)=C2