Reaction Details
TargetGlycine receptor subunit alpha-1
LigandBDBM50048280
Substrate/Competitorn/a
Meas. Tech.ChEMBL_1474520 (CHEMBL3423809)
EC50 1300±n/a nM
Citation Wells, MMTillman, TSMowrey, DDSun, TXu, YTang, P Ensemble-based virtual screening for cannabinoid-like potentiators of the human glycine receptora1 for the treatment of pain. J Med Chem58:2958-66 (2015) 
 
Glycine receptor subunit alpha-1
Name:Glycine receptor subunit alpha-1
Type:Enzyme Catalytic Domain
Mol. Mass.:52635.39
Organism:Homo sapiens (Human)
Description:P23415
Residue:457
BDBM50048280
NameBDBM50048280
Synonyms:6-(3-(1-Adamantyl)-4-methoxyphenyl)-2-naphthoic acid ADAPALENE | CHEMBL1265
TypeSmall organic molecule
Emp. Form.C28H28O3
Mol. Mass.412.5201
SMILESCOc1ccc(cc1C12CC3CC(CC(C3)C1)C2)-c1ccc2cc(ccc2c1)C(O)=O