Reaction Details
TargetGlycine receptor subunit alpha-1
LigandBDBM50022889
Substrate/Competitorn/a
Meas. Tech.ChEMBL_1474520 (CHEMBL3423809)
EC50 2500±n/a nM
Citation Wells, MMTillman, TSMowrey, DDSun, TXu, YTang, P Ensemble-based virtual screening for cannabinoid-like potentiators of the human glycine receptora1 for the treatment of pain. J Med Chem58:2958-66 (2015) 
 
Glycine receptor subunit alpha-1
Name:Glycine receptor subunit alpha-1
Type:Enzyme Catalytic Domain
Mol. Mass.:52635.39
Organism:Homo sapiens (Human)
Description:P23415
Residue:457
BDBM50022889
NameBDBM50022889
Synonyms:(2,8-Bis-trifluoromethyl-quinolin-4-yl)-(1-methyl-piperidin-2-yl)-methanol (2,8-Bis-trifluoromethyl-quinolin-4-yl)-piperidin-2-yl-methanol( Mefloquine) (2,8-bis(trifluoromethyl)quinolin-4-yl)(piperidin-2-yl)methanol (S)-(2,8-Bis-trifluoromethyl-quinolin-4-yl)-piperidin-2-yl-methanol 2,8-di(trifluoromethyl)-4-quinolyl-hexahydro-2-pyridinylmethanol(Mefloquine) CHEMBL416956 Lariam [2,8-bis(trifluoromethyl)quinolin-4-yl]-(2-piperidyl)methanol melfoquine rel-(2,8-bis(trifluoromethyl)quinolin-4-yl)(piperidin-2-yl)methanol
TypeSmall organic molecule
Emp. Form.C17H16F6N2O
Mol. Mass.378.3122
SMILESOC(C1CCCCN1)c1cc(nc2c(cccc12)C(F)(F)F)C(F)(F)F