Reaction Details
TargetCytochrome P450 1A1
LigandBDBM50081668
Substrate/Competitorn/a
Meas. Tech.ChEMBL_1474527 (CHEMBL3423816)
IC50 36±n/a nM
Citation Cui, JMeng, QZhang, XCui, QZhou, WLi, S Design and Synthesis of Newa-Naphthoflavones as Cytochrome P450 (CYP) 1B1 Inhibitors To Overcome Docetaxel-Resistance Associated with CYP1B1 Overexpression. J Med Chem58:3534-47 (2015) 
 
Cytochrome P450 1A1
Name:Cytochrome P450 1A1
Type:Protein
Mol. Mass.:58177.23
Organism:Homo sapiens (Human)
Description:P04798
Residue:512
BDBM50081668
NameBDBM50081668
Synonyms:CHEMBL3421640
TypeSmall organic molecule
Emp. Form.C30H33ClFNO10
Mol. Mass.622.035
SMILESCl.COc1ccc(OC)c2c3oc(-c4cccc(F)c4)c(OCCOCCOCCOC(=O)CN)c(=O)c3cc(OC)c12