Reaction Details
TargetCytochrome P450 1A2
LigandBDBM50081720
Substrate/Competitorn/a
Meas. Tech.ChEMBL_1474528 (CHEMBL3423817)
IC50 16±n/a nM
Citation Cui, JMeng, QZhang, XCui, QZhou, WLi, S Design and Synthesis of Newa-Naphthoflavones as Cytochrome P450 (CYP) 1B1 Inhibitors To Overcome Docetaxel-Resistance Associated with CYP1B1 Overexpression. J Med Chem58:3534-47 (2015) 
 
Cytochrome P450 1A2
Name:Cytochrome P450 1A2
Type:Enzyme
Mol. Mass.:58423.38
Organism:Homo sapiens (Human)
Description:P05177
Residue:516
BDBM50081720
NameBDBM50081720
Synonyms:CHEMBL3422340
TypeSmall organic molecule
Emp. Form.C23H20O6
Mol. Mass.392.4013
SMILESCOc1ccc(cc1)-c1cc(=O)c2cc(OC)c3c(OC)ccc(OC)c3c2o1