Reaction Details
TargetCytochrome P450 1A1
LigandBDBM50081710
Substrate/Competitorn/a
Meas. Tech.ChEMBL_1474527 (CHEMBL3423816)
IC50 5.9±n/a nM
Citation Cui, JMeng, QZhang, XCui, QZhou, WLi, S Design and Synthesis of Newa-Naphthoflavones as Cytochrome P450 (CYP) 1B1 Inhibitors To Overcome Docetaxel-Resistance Associated with CYP1B1 Overexpression. J Med Chem58:3534-47 (2015) 
 
Cytochrome P450 1A1
Name:Cytochrome P450 1A1
Type:Protein
Mol. Mass.:58177.23
Organism:Homo sapiens (Human)
Description:P04798
Residue:512
BDBM50081710
NameBDBM50081710
Synonyms:CHEMBL3422258
TypeSmall organic molecule
Emp. Form.C22H17FO5
Mol. Mass.380.3658
SMILESCOc1ccc(OC)c2c3oc(cc(=O)c3cc(OC)c12)-c1ccccc1F