Reaction Details
TargetCytochrome P450 1B1
LigandBDBM50081722
Substrate/Competitorn/a
Meas. Tech.ChEMBL_1474526 (CHEMBL3423815)
IC50 9.8±n/a nM
Citation Cui, JMeng, QZhang, XCui, QZhou, WLi, S Design and Synthesis of Newa-Naphthoflavones as Cytochrome P450 (CYP) 1B1 Inhibitors To Overcome Docetaxel-Resistance Associated with CYP1B1 Overexpression. J Med Chem58:3534-47 (2015) 
 
Cytochrome P450 1B1
Name:Cytochrome P450 1B1
Type:PROTEIN
Mol. Mass.:60861.81
Organism:Homo sapiens (Human)
Description:ChEMBL_1474523
Residue:543
BDBM50081722
NameBDBM50081722
Synonyms:CHEMBL3422342
TypeSmall organic molecule
Emp. Form.C25H24O8
Mol. Mass.452.4533
SMILESCOc1cc(cc(OC)c1OC)-c1cc(=O)c2cc(OC)c3c(OC)ccc(OC)c3c2o1