Reaction Details
TargetNeuronal acetylcholine receptor subunit alpha-7
LigandBDBM50300803
Substrate/Competitorn/a
Meas. Tech.ChEMBL_1475131 (CHEMBL3424809)
Ki 220±n/a nM
Citation Beinat, CReekie, TBanister, SDO'Brien-Brown, JXie, TOlson, TTXiao, YHarvey, AO'Connor, SColes, CGrishin, AKolesik, PTsanaktsidis, JKassiou, M Structure-activity relationship studies of SEN12333 analogues: determination of the optimal requirements for binding affinities ata7 nAChRs through incorporation of known structural motifs. Eur J Med Chem95:277-301 (2015) 
 
Neuronal acetylcholine receptor subunit alpha-7
Name:Neuronal acetylcholine receptor subunit alpha-7
Type:Enzyme
Mol. Mass.:56502.44
Organism:Rattus norvegicus (Rat)
Description:Q05941
Residue:502
BDBM50300803
NameBDBM50300803
Synonyms:5-(piperidin-1-yl)-N-(4-(pyridin-3-yl)phenyl)pentanamide CHEMBL565963
TypeSmall organic molecule
Emp. Form.C21H27N3O
Mol. Mass.337.4586
SMILESO=C(CCCCN1CCCCC1)Nc1ccc(cc1)-c1cccnc1