Reaction Details
TargetNeuronal acetylcholine receptor subunit alpha-7
LigandBDBM50082097
Substrate/Competitorn/a
Meas. Tech.ChEMBL_1475131 (CHEMBL3424809)
Ki 330±n/a nM
Citation Beinat, CReekie, TBanister, SDO'Brien-Brown, JXie, TOlson, TTXiao, YHarvey, AO'Connor, SColes, CGrishin, AKolesik, PTsanaktsidis, JKassiou, M Structure-activity relationship studies of SEN12333 analogues: determination of the optimal requirements for binding affinities ata7 nAChRs through incorporation of known structural motifs. Eur J Med Chem95:277-301 (2015) 
 
Neuronal acetylcholine receptor subunit alpha-7
Name:Neuronal acetylcholine receptor subunit alpha-7
Type:Enzyme
Mol. Mass.:56502.44
Organism:Rattus norvegicus (Rat)
Description:Q05941
Residue:502
BDBM50082097
NameBDBM50082097
Synonyms:CHEMBL3422579
TypeSmall organic molecule
Emp. Form.C20H25N3O2
Mol. Mass.339.4314
SMILESO=C(CCCCN1CCOCC1)Nc1ccc(cc1)-c1ccccn1