Reaction Details
TargetCytochrome P450 11B1, mitochondrial
LigandBDBM50439057
Substrate/Competitorn/a
Meas. Tech.ChEMBL_1475486 (CHEMBL3424479)
IC50 2.0±n/a nM
Citation Hu, QKunde, JHanke, NHartmann, RW Identification of 4-(4-nitro-2-phenethoxyphenyl)pyridine as a promising new lead for discovering inhibitors of both human and rat 11ß-Hydroxylase. Eur J Med Chem96:139-50 (2015) 
 
Cytochrome P450 11B1, mitochondrial
Name:Cytochrome P450 11B1, mitochondrial
Type:Enzyme
Mol. Mass.:57591.44
Organism:Homo sapiens (Human)
Description:P15538
Residue:503
BDBM50439057
NameBDBM50439057
Synonyms:CHEMBL2417553
TypeSmall organic molecule
Emp. Form.C18H16N2
Mol. Mass.260.333
SMILESCc1cncc(Cc2ccc(nc2)-c2ccccc2)c1