Reaction Details
TargetCarbonic anhydrase 1
LigandBDBM50082686
Substrate/Competitorn/a
Meas. Tech.ChEMBL_1475737 (CHEMBL3424939)
Ki 448±n/a nM
Citation Durgun, MTurkmen, HCeruso, MSupuran, CT Synthesis of Schiff base derivatives of 4-(2-aminoethyl)-benzenesulfonamide with inhibitory activity against carbonic anhydrase isoforms I, II, IX and XII. Bioorg Med Chem Lett25:2377-81 (2015) 
 
Carbonic anhydrase 1
Name:Carbonic anhydrase 1
Type:Enzyme
Mol. Mass.:28873.37
Organism:Homo sapiens (Human)
Description:P00915
Residue:261
BDBM50082686
NameBDBM50082686
Synonyms:CHEMBL3423251
TypeSmall organic molecule
Emp. Form.C16H18N2O3S
Mol. Mass.318.391
SMILESCc1cccc(\C=N/CCc2ccc(cc2)S(N)(=O)=O)c1O