Reaction Details
TargetCarbonic anhydrase 1
LigandBDBM50082740
Substrate/Competitorn/a
Meas. Tech.ChEMBL_1475737 (CHEMBL3424939)
Ki 351±n/a nM
Citation Durgun, MTurkmen, HCeruso, MSupuran, CT Synthesis of Schiff base derivatives of 4-(2-aminoethyl)-benzenesulfonamide with inhibitory activity against carbonic anhydrase isoforms I, II, IX and XII. Bioorg Med Chem Lett25:2377-81 (2015) 
 
Carbonic anhydrase 1
Name:Carbonic anhydrase 1
Type:Enzyme
Mol. Mass.:28873.37
Organism:Homo sapiens (Human)
Description:P00915
Residue:261
BDBM50082740
NameBDBM50082740
Synonyms:CHEMBL3423253
TypeSmall organic molecule
Emp. Form.C15H15BrN2O3S
Mol. Mass.383.26
SMILESNS(=O)(=O)c1ccc(CC\N=C/c2cc(Br)ccc2O)cc1