Reaction Details
TargetCarbonic anhydrase 12
LigandBDBM50082754
Substrate/Competitorn/a
Meas. Tech.ChEMBL_1475802 (CHEMBL3425068)
Ki 2142±n/a nM
Citation Durgun, MTurkmen, HCeruso, MSupuran, CT Synthesis of Schiff base derivatives of 4-(2-aminoethyl)-benzenesulfonamide with inhibitory activity against carbonic anhydrase isoforms I, II, IX and XII. Bioorg Med Chem Lett25:2377-81 (2015) 
 
Carbonic anhydrase 12
Name:Carbonic anhydrase 12
Type:Enzyme
Mol. Mass.:39456.00
Organism:Homo sapiens (Human)
Description:Catalytic domain of human cloned isozyme was used in the assay
Residue:354
BDBM50082754
NameBDBM50082754
Synonyms:CHEMBL3423255
TypeSmall organic molecule
Emp. Form.C15H15ClN2O3S
Mol. Mass.338.809
SMILESNS(=O)(=O)c1ccc(CC\N=C/c2cc(Cl)ccc2O)cc1