Reaction Details
TargetCarbonic anhydrase 2
LigandBDBM50082755
Substrate/Competitorn/a
Meas. Tech.ChEMBL_1475738 (CHEMBL3424940)
Ki 819±n/a nM
Citation Durgun, MTurkmen, HCeruso, MSupuran, CT Synthesis of Schiff base derivatives of 4-(2-aminoethyl)-benzenesulfonamide with inhibitory activity against carbonic anhydrase isoforms I, II, IX and XII. Bioorg Med Chem Lett25:2377-81 (2015) 
 
Carbonic anhydrase 2
Name:Carbonic anhydrase 2
Type:Enzyme
Mol. Mass.:29250.71
Organism:Homo sapiens (Human)
Description:P00918
Residue:260
BDBM50082755
NameBDBM50082755
Synonyms:CHEMBL3423256
TypeSmall organic molecule
Emp. Form.C22H22N2O3S
Mol. Mass.394.487
SMILESNS(=O)(=O)c1ccc(CC\N=C/c2ccc(OCc3ccccc3)cc2)cc1