Reaction Details
TargetCarbonic anhydrase 2
LigandBDBM50082758
Substrate/Competitorn/a
Meas. Tech.ChEMBL_1475738 (CHEMBL3424940)
Ki 30±n/a nM
Citation Durgun, MTurkmen, HCeruso, MSupuran, CT Synthesis of Schiff base derivatives of 4-(2-aminoethyl)-benzenesulfonamide with inhibitory activity against carbonic anhydrase isoforms I, II, IX and XII. Bioorg Med Chem Lett25:2377-81 (2015) 
 
Carbonic anhydrase 2
Name:Carbonic anhydrase 2
Type:Enzyme
Mol. Mass.:29250.71
Organism:Homo sapiens (Human)
Description:P00918
Residue:260
BDBM50082758
NameBDBM50082758
Synonyms:CHEMBL3423267
TypeSmall organic molecule
Emp. Form.C15H16Cl2N2O3S
Mol. Mass.375.27
SMILESNS(=O)(=O)c1ccc(CCNCc2cc(Cl)cc(Cl)c2O)cc1