Reaction Details
TargetCarbonic anhydrase 1
LigandBDBM50082759
Substrate/Competitorn/a
Meas. Tech.ChEMBL_1475737 (CHEMBL3424939)
Ki 16±n/a nM
Citation Durgun, MTurkmen, HCeruso, MSupuran, CT Synthesis of Schiff base derivatives of 4-(2-aminoethyl)-benzenesulfonamide with inhibitory activity against carbonic anhydrase isoforms I, II, IX and XII. Bioorg Med Chem Lett25:2377-81 (2015) 
 
Carbonic anhydrase 1
Name:Carbonic anhydrase 1
Type:Enzyme
Mol. Mass.:28873.37
Organism:Homo sapiens (Human)
Description:P00915
Residue:261
BDBM50082759
NameBDBM50082759
Synonyms:CHEMBL3423268
TypeSmall organic molecule
Emp. Form.C17H23N3O2S
Mol. Mass.333.448
SMILESCN(C)c1ccc(CNCCc2ccc(cc2)S(N)(=O)=O)cc1