Reaction Details
TargetCarbonic anhydrase 2
LigandBDBM50082761
Substrate/Competitorn/a
Meas. Tech.ChEMBL_1475738 (CHEMBL3424940)
Ki 315±n/a nM
Citation Durgun, MTurkmen, HCeruso, MSupuran, CT Synthesis of Schiff base derivatives of 4-(2-aminoethyl)-benzenesulfonamide with inhibitory activity against carbonic anhydrase isoforms I, II, IX and XII. Bioorg Med Chem Lett25:2377-81 (2015) 
 
Carbonic anhydrase 2
Name:Carbonic anhydrase 2
Type:Enzyme
Mol. Mass.:29250.71
Organism:Homo sapiens (Human)
Description:P00918
Residue:260
BDBM50082761
NameBDBM50082761
Synonyms:CHEMBL3423260
TypeSmall organic molecule
Emp. Form.C15H16Br2N2O3S
Mol. Mass.464.172
SMILESNS(=O)(=O)c1ccc(CCNCc2cc(Br)cc(Br)c2O)cc1