Reaction Details
TargetCarbonic anhydrase 9
LigandBDBM50082761
Substrate/Competitorn/a
Meas. Tech.ChEMBL_1475739 (CHEMBL3424941)
Ki 4.1±n/a nM
Citation Durgun, MTurkmen, HCeruso, MSupuran, CT Synthesis of Schiff base derivatives of 4-(2-aminoethyl)-benzenesulfonamide with inhibitory activity against carbonic anhydrase isoforms I, II, IX and XII. Bioorg Med Chem Lett25:2377-81 (2015) 
 
Carbonic anhydrase 9
Name:Carbonic anhydrase 9
Type:Enzyme
Mol. Mass.:49669.03
Organism:Homo sapiens (Human)
Description:Catalytic domain of human cloned isozyme was used in the assay
Residue:459
BDBM50082761
NameBDBM50082761
Synonyms:CHEMBL3423260
TypeSmall organic molecule
Emp. Form.C15H16Br2N2O3S
Mol. Mass.464.172
SMILESNS(=O)(=O)c1ccc(CCNCc2cc(Br)cc(Br)c2O)cc1