Reaction Details
TargetCarbonic anhydrase 12
LigandBDBM50013771
Substrate/Competitorn/a
Meas. Tech.ChEMBL_1475802 (CHEMBL3425068)
Ki 6.3±n/a nM
Citation Durgun, MTurkmen, HCeruso, MSupuran, CT Synthesis of Schiff base derivatives of 4-(2-aminoethyl)-benzenesulfonamide with inhibitory activity against carbonic anhydrase isoforms I, II, IX and XII. Bioorg Med Chem Lett25:2377-81 (2015) 
 
Carbonic anhydrase 12
Name:Carbonic anhydrase 12
Type:Enzyme
Mol. Mass.:39456.00
Organism:Homo sapiens (Human)
Description:Catalytic domain of human cloned isozyme was used in the assay
Residue:354
BDBM50013771
NameBDBM50013771
Synonyms:CHEMBL3264980
TypeSmall organic molecule
Emp. Form.C15H18N2O2S
Mol. Mass.290.381
SMILESNS(=O)(=O)c1ccc(CCNCc2ccccc2)cc1