Reaction Details
TargetCarbonic anhydrase 1
LigandBDBM50082766
Substrate/Competitorn/a
Meas. Tech.ChEMBL_1475737 (CHEMBL3424939)
Ki 17±n/a nM
Citation Durgun, MTurkmen, HCeruso, MSupuran, CT Synthesis of Schiff base derivatives of 4-(2-aminoethyl)-benzenesulfonamide with inhibitory activity against carbonic anhydrase isoforms I, II, IX and XII. Bioorg Med Chem Lett25:2377-81 (2015) 
 
Carbonic anhydrase 1
Name:Carbonic anhydrase 1
Type:Enzyme
Mol. Mass.:28873.37
Organism:Homo sapiens (Human)
Description:P00915
Residue:261
BDBM50082766
NameBDBM50082766
Synonyms:CHEMBL3423265
TypeSmall organic molecule
Emp. Form.C15H17ClN2O3S
Mol. Mass.340.825
SMILESNS(=O)(=O)c1ccc(CCNCc2cc(Cl)ccc2O)cc1