Reaction Details
TargetCannabinoid receptor 1
LigandBDBM50082769
Substrate/Competitorn/a
Meas. Tech.ChEMBL_1475932 (CHEMBL3425329)
Ki 139±n/a nM
Citation Manera, CMalfitano, AMParkkari, TLucchesi, VCarpi, SFogli, SBertini, SLaezza, CLigresti, ASaccomanni, GSavinainen, JRCiaglia, EPisanti, SGazzerro, PDi Marzo, VNieri, PMacchia, MBifulco, M New quinolone- and 1,8-naphthyridine-3-carboxamides as selective CB2 receptor agonists with anticancer and immuno-modulatory activity. Eur J Med Chem97:10-8 (2015) 
 
Cannabinoid receptor 1
Name:Cannabinoid receptor 1
Type:G Protein-Coupled Receptor (GPCR)
Mol. Mass.:52868.96
Organism:Homo sapiens (Human)
Description:P21554
Residue:472
BDBM50082769
NameBDBM50082769
Synonyms:CHEMBL3422790
TypeSmall organic molecule
Emp. Form.C23H24FN3O3
Mol. Mass.409.4534
SMILESCC1CCC(CC1)NC(=O)c1c(O)c2cccnc2n(Cc2ccc(F)cc2)c1=O