Reaction Details
TargetCell division protein FtsZ
LigandBDBM50083355
Substrate/Competitorn/a
Meas. Tech.ChEMBL_1474226 (CHEMBL3424284)
IC50 90500±n/a nM
Citation Li, XSheng, JHuang, GMa, RYin, FSong, DZhao, CMa, S Design, synthesis and antibacterial activity of cinnamaldehyde derivatives as inhibitors of the bacterial cell division protein FtsZ. Eur J Med Chem97:32-41 (2015) 
 
Cell division protein FtsZ
Name:Cell division protein FtsZ
Type:Protein
Mol. Mass.:40305.83
Organism:Escherichia coli
Description:P0A9A6
Residue:383
BDBM50083355
NameBDBM50083355
Synonyms:CHEMBL3423282
TypeSmall organic molecule
Emp. Form.C17H12Cl2N2O
Mol. Mass.331.196
SMILESCc1nc2ccccc2n1C(=O)\C=C\c1ccc(Cl)cc1Cl