Reaction Details
TargetPeroxisome proliferator-activated receptor gamma
LigandBDBM50084041
Substrate/Competitorn/a
Meas. Tech.ChEMBL_1477131 (CHEMBL3428440)
Ki 176±n/a nM
Citation Du, GFeng, LYang, ZShi, JHuang, CGuo, FLi, BZhu, WLi, Y Separation and peroxisome proliferator-activated receptor-¿ agonist activity evaluation of synthetic racemic bavachinin enantiomers. Bioorg Med Chem Lett25:2579-83 (2015) 
 
Peroxisome proliferator-activated receptor gamma
Name:Peroxisome proliferator-activated receptor gamma
Type:Nuclear Receptor
Mol. Mass.:57613.46
Organism:Homo sapiens (Human)
Description:P37231
Residue:505
BDBM50084041
NameBDBM50084041
Synonyms:Bavachinin
TypeSmall organic molecule
Emp. Form.C21H20O4
Mol. Mass.336.3811
SMILES[#6]-[#8]-c1cc2oc(cc(=O)c2cc1-[#6]\[#6]=[#6](\[#6])-[#6])-c1ccc(-[#8])cc1