Reaction Details
TargetActivated CDC42 kinase 1
LigandBDBM50084446
Substrate/Competitorn/a
Meas. Tech.ChEMBL_1477698 (CHEMBL3428296)
IC50 164±n/a nM
Citation Lawrence, HRMahajan, KLuo, YZhang, DTindall, NHuseyin, MGevariya, HKazi, SOzcan, SMahajan, NPLawrence, NJ Development of novel ACK1/TNK2 inhibitors using a fragment-based approach. J Med Chem58:2746-63 (2015) 
 
Activated CDC42 kinase 1
Name:Activated CDC42 kinase 1
Type:Protein
Mol. Mass.:114577.86
Organism:Homo sapiens (Human)
Description:Q07912
Residue:1038
BDBM50084446
NameBDBM50084446
Synonyms:CHEMBL3426860
TypeSmall organic molecule
Emp. Form.C15H17BrN4O2
Mol. Mass.365.225
SMILESOc1ccc(Nc2ncc(Br)c(NCC3CCCO3)n2)cc1