Reaction Details
TargetALK tyrosine kinase receptor
LigandBDBM50084464
Substrate/Competitorn/a
Meas. Tech.ChEMBL_1477870 (CHEMBL3429149)
IC50 143±n/a nM
Citation Lawrence, HRMahajan, KLuo, YZhang, DTindall, NHuseyin, MGevariya, HKazi, SOzcan, SMahajan, NPLawrence, NJ Development of novel ACK1/TNK2 inhibitors using a fragment-based approach. J Med Chem58:2746-63 (2015) 
 
ALK tyrosine kinase receptor
Name:ALK tyrosine kinase receptor
Type:Protein
Mol. Mass.:176453.10
Organism:Homo sapiens (Human)
Description:Q9UM73
Residue:1620
BDBM50084464
NameBDBM50084464
Synonyms:CHEMBL3426891
TypeSmall organic molecule
Emp. Form.C20H27ClN6O
Mol. Mass.402.921
SMILESCN1CCN(CC1)c1ccc(Nc2ncc(Cl)c(NC[C@H]3CCCO3)n2)cc1