Reaction Details
TargetTyrosine-protein kinase Lck
LigandBDBM50204589
Substrate/Competitorn/a
Meas. Tech.ChEMBL_1477871 (CHEMBL3429150)
IC50 122±n/a nM
Citation Lawrence, HRMahajan, KLuo, YZhang, DTindall, NHuseyin, MGevariya, HKazi, SOzcan, SMahajan, NPLawrence, NJ Development of novel ACK1/TNK2 inhibitors using a fragment-based approach. J Med Chem58:2746-63 (2015) 
 
Tyrosine-protein kinase Lck
Name:Tyrosine-protein kinase Lck
Type:n/a
Mol. Mass.:57987.83
Organism:Homo sapiens (Human)
Description:P06239
Residue:509
BDBM50204589
NameBDBM50204589
Synonyms:(S)-5,6-diphenyl-N-((tetrahydrofuran-2-yl)methyl)furo[2,3-d]pyrimidin-4-amine | CHEMBL247070
TypeSmall organic molecule
Emp. Form.C23H21N3O2
Mol. Mass.371.4317
SMILESC(Nc1ncnc2oc(c(-c3ccccc3)c12)-c1ccccc1)[C@@H]1CCCO1