Reaction Details
TargetActivated CDC42 kinase 1
LigandBDBM50337126
Substrate/Competitorn/a
Meas. Tech.ChEMBL_1477876 (CHEMBL3429155)
Kd 2.0±n/a nM
Citation Lawrence, HRMahajan, KLuo, YZhang, DTindall, NHuseyin, MGevariya, HKazi, SOzcan, SMahajan, NPLawrence, NJ Development of novel ACK1/TNK2 inhibitors using a fragment-based approach. J Med Chem58:2746-63 (2015) 
 
Activated CDC42 kinase 1
Name:Activated CDC42 kinase 1
Type:Protein
Mol. Mass.:114577.86
Organism:Homo sapiens (Human)
Description:Q07912
Residue:1038
BDBM50337126
NameBDBM50337126
Synonyms:2-(2-methoxy-4-(4-methylpiperazin-1-yl)phenylamino)-11-methyl-5H-benzo[e]pyrimido[5,4-b][1,4]diazepin-6(11H)-one Scaffold, B19 | US9266890, IV-2
TypeSmall organic molecule
Emp. Form.C24H27N7O2
Mol. Mass.445.5169
SMILESCOc1cc(ccc1Nc1ncc2NC(=O)c3ccccc3N(C)c2n1)N1CCN(C)CC1