Reaction Details
TargetPoly [ADP-ribose] polymerase 1
LigandBDBM50446130
Substrate/Competitorn/a
Meas. Tech.ChEMBL_1476126 (CHEMBL3428885)
IC50>500±n/a nM
Citation Jones, PWilcoxen, KRowley, MToniatti, C Niraparib: A Poly(ADP-ribose) Polymerase (PARP) Inhibitor for the Treatment of Tumors with Defective Homologous Recombination. J Med Chem58:3302-14 (2015) 
 
Poly [ADP-ribose] polymerase 1
Name:Poly [ADP-ribose] polymerase 1
Type:n/a
Mol. Mass.:113114.22
Organism:Homo sapiens (Human)
Description:P09874
Residue:1014
BDBM50446130
NameBDBM50446130
Synonyms:AG-014699 RUCAPARIB CAMSYLATE | Rucaparib
TypeSmall organic molecule
Emp. Form.C19H18FN3O
Mol. Mass.323.3641
SMILESCNCc1ccc(cc1)-c1[nH]c2cc(F)cc3C(=O)NCCc1c23