Reaction Details
TargetPoly [ADP-ribose] polymerase 1
LigandBDBM50316225
Substrate/Competitorn/a
Meas. Tech.ChEMBL_1476126 (CHEMBL3428885)
IC50 2.4±n/a nM
Citation Jones, PWilcoxen, KRowley, MToniatti, C Niraparib: A Poly(ADP-ribose) Polymerase (PARP) Inhibitor for the Treatment of Tumors with Defective Homologous Recombination. J Med Chem58:3302-14 (2015) 
 
Poly [ADP-ribose] polymerase 1
Name:Poly [ADP-ribose] polymerase 1
Type:n/a
Mol. Mass.:113114.22
Organism:Homo sapiens (Human)
Description:P09874
Residue:1014
BDBM50316225
NameBDBM50316225
Synonyms:(R)-2-(4-(piperidin-3-yl)phenyl)-2H-indazole-7-carboxamide | CHEMBL1097260
TypeSmall organic molecule
Emp. Form.C19H20N4O
Mol. Mass.320.3883
SMILESNC(=O)c1cccc2cn(nc12)-c1ccc(cc1)[C@H]1CCCNC1