Reaction Details
TargetPoly [ADP-ribose] polymerase 1
LigandBDBM50316244
Substrate/Competitorn/a
Meas. Tech.ChEMBL_1476126 (CHEMBL3428885)
IC50 3.7±n/a nM
Citation Jones, PWilcoxen, KRowley, MToniatti, C Niraparib: A Poly(ADP-ribose) Polymerase (PARP) Inhibitor for the Treatment of Tumors with Defective Homologous Recombination. J Med Chem58:3302-14 (2015) 
 
Poly [ADP-ribose] polymerase 1
Name:Poly [ADP-ribose] polymerase 1
Type:n/a
Mol. Mass.:113114.22
Organism:Homo sapiens (Human)
Description:P09874
Residue:1014
BDBM50316244
NameBDBM50316244
Synonyms:2-(4-((dimethylamino)methyl)phenyl)-2H-indazole-7-carboxamide | CHEMBL1096641
TypeSmall organic molecule
Emp. Form.C17H18N4O
Mol. Mass.294.351
SMILESCN(C)Cc1ccc(cc1)-n1cc2cccc(C(N)=O)c2n1