Reaction Details
TargetPoly [ADP-ribose] polymerase 1
LigandBDBM50316246
Substrate/Competitorn/a
Meas. Tech.ChEMBL_1476126 (CHEMBL3428885)
IC50 55±n/a nM
Citation Jones, PWilcoxen, KRowley, MToniatti, C Niraparib: A Poly(ADP-ribose) Polymerase (PARP) Inhibitor for the Treatment of Tumors with Defective Homologous Recombination. J Med Chem58:3302-14 (2015) 
 
Poly [ADP-ribose] polymerase 1
Name:Poly [ADP-ribose] polymerase 1
Type:n/a
Mol. Mass.:113114.22
Organism:Homo sapiens (Human)
Description:P09874
Residue:1014
BDBM50316246
NameBDBM50316246
Synonyms:2-phenylpyrazolo-[1,5-a]pyridine-7-carboxamide | CHEMBL1169488
TypeSmall organic molecule
Emp. Form.C14H17N3O
Mol. Mass.243.3043
SMILESNC(=O)c1cccc2cc(nn12)C1CCCCC1