Reaction Details
TargetPoly [ADP-ribose] polymerase 1
LigandBDBM50306166
Substrate/Competitorn/a
Meas. Tech.ChEMBL_1476126 (CHEMBL3428885)
IC50 24±n/a nM
Citation Jones, PWilcoxen, KRowley, MToniatti, C Niraparib: A Poly(ADP-ribose) Polymerase (PARP) Inhibitor for the Treatment of Tumors with Defective Homologous Recombination. J Med Chem58:3302-14 (2015) 
 
Poly [ADP-ribose] polymerase 1
Name:Poly [ADP-ribose] polymerase 1
Type:n/a
Mol. Mass.:113114.22
Organism:Homo sapiens (Human)
Description:P09874
Residue:1014
BDBM50306166
NameBDBM50306166
Synonyms:2-phenyl-2H-indazole-7-carboxamide | CHEMBL594298
TypeSmall organic molecule
Emp. Form.C14H11N3O
Mol. Mass.237.2566
SMILESNC(=O)c1cccc2cn(nc12)-c1ccccc1