Reaction Details
TargetPatatin-like phospholipase domain-containing protein 2
LigandBDBM50084840
Substrate/Competitorn/a
Meas. Tech.ChEMBL_1476694 (CHEMBL3428915)
IC50>150000±n/a nM
Citation Mayer, NSchweiger, MMelcher, MCFledelius, CZechner, RZimmermann, RBreinbauer, R Structure-activity studies in the development of a hydrazone based inhibitor of adipose-triglyceride lipase (ATGL). Bioorg Med Chem23:2904-16 (2015) 
 
Patatin-like phospholipase domain-containing protein 2
Name:Patatin-like phospholipase domain-containing protein 2
Type:PROTEIN
Mol. Mass.:53655.79
Organism:Mus musculus
Description:ChEMBL_109612
Residue:486
BDBM50084840
NameBDBM50084840
Synonyms:CHEMBL3427334
TypeSmall organic molecule
Emp. Form.C17H18BrN3
Mol. Mass.344.249
SMILESBrc1ccccc1\C=N\N1CCN(CC1)c1ccccc1